HOME > 게시판 > 초보자용게시판
게시판| 초보자용게시판
※ 게시판 용도에 맞지 않는 글(광고및 홍보 글 등)은 임의삭제될 수 있습니다.

 
작성일 : 07-09-15 22:25
wine 설치중 오류입니다.
 글쓴이 : 리눅스초보
조회 : 2,175  
gcc -c -I. -I. -I../../include -I../../include -D__WINESRC__ -DCOM_NO_WINDOWS_H -D_REENTRANT -fPIC -Wall -pipe -fno-strict-aliasing -Wdeclaration-after-statement -Wwrite-strings -Wpointer-arith -g -O2 -o dplobby.o dplobby.c
dplobby.c: In function ‘DPL_CreateCompoundAddress’:
dplobby.c:1659: warning: implicit declaration of function ‘sijeof’
dplobby.c:1659: error: expected expression before ‘DPADDRESS’
make[2]: *** [dplobby.o] 오류 1
make[2]: Leaving directory `/root/download/wine-0.9.44/dlls/dplayx'
make[1]: *** [dplayx] 오류 2
make[1]: Leaving directory `/root/download/wine-0.9.44/dlls'
make: *** [dlls] 오류 2



#./configure

#make depend

여기까지는 잘 되었는데


#make 를 실행하고 쭉 컴파일 하던중에 오류가 났습니다. 해결방법이 없을까요?

이 글을 트위터로 보내기 이 글을 페이스북으로 보내기